Target
C-C chemokine receptor type 5
Ligand
BDBM50359476
Substrate
Meas. Tech.
ChEMBL_792600 (CHEMBL1930241)
IC50
50±n/a nM
Citation
 Skerlj, RBridger, GZhou, YBourque, EMcEachern, ELangille, JHarwig, CVeale, DYang, WLi, TZhu, YBey, MBaird, ISartori, MMetz, MMosi, RNelson, KBodart, VWong, RFricker, SMac Farland, RHuskens, DSchols, D Design and synthesis of pyridin-2-ylmethylaminopiperidin-1-ylbutyl amide CCR5 antagonists that are potent inhibitors of M-tropic (R5) HIV-1 replication. Bioorg Med Chem Lett 21:6950-4 (2011)  
Target
Name:
C-C chemokine receptor type 5
Synonyms:
C-C CKR-5 CC-CKR-5 CCR5 CCR5_HUMAN CHEMR13 HIV-1 fusion coreceptor
Type:
Enzyme
Mol. Mass.:
40540.21
Organism:
Homo sapiens (Human)
Description:
P51681
Residue:
352
  
Inhibitor
Name:
BDBM50359476
Synonyms:
CHEMBL1926873
Type:
Small organic molecule
Emp. Form.:
C29H34Cl2N4O2
Mol. Mass.:
541.512
SMILES:
COc1ccc(cc1)N(Cc1ccccc1)C1CCN(CC1)C(C)CCNC(=O)c1c(Cl)cncc1Cl
: