Target
Papain
Ligand
BDBM50157741
Substrate
Meas. Tech.
ChEMBL_792720 (CHEMBL1930547)
IC50
2±n/a nM
Citation
 Glória, PMGut, JGonçalves, LMRosenthal, PJMoreira, RSantos, MM Aza vinyl sulfones: synthesis and evaluation as antiplasmodial agents. Bioorg Med Chem 19:7635-42 (2011)  
Target
Name:
Papain
Synonyms:
Allergen=Car p 1 PPI | Papaya proteinase I
Type:
Enzyme
Mol. Mass.:
38923.01
Organism:
Carica papaya
Description:
Papain was purchased from Sigma, Germany.
Residue:
345
  
Inhibitor
Name:
BDBM50157741
Synonyms:
CHEMBL374508 E64
Type:
Small organic molecule
Emp. Form.:
C15H27N5O5
Mol. Mass.:
357.4054
SMILES:
[#6]-[#6](-[#6])-[#6]-[#6@H](-[#7]-[#6](=O)-[#6@H]-1-[#8]-[#6@@H]-1-[#6](-[#8])=O)-[#6](=O)-[#7]-[#6]-[#6]-[#6]-[#6]\[#7]=[#6](/[#7])-[#7]
: