Target
Amine oxidase [flavin-containing] B
Ligand
BDBM50359639
Substrate
Meas. Tech.
ChEMBL_792782 (CHEMBL1930785)
Ki
3000±n/a nM
Citation
 Coelho Cerqueira, ENetz, PADiniz, CPetry do Canto, VFollmer, C Molecular insights into human monoamine oxidase (MAO) inhibition by 1,4-naphthoquinone: evidences for menadione (vitamin K3) acting as a competitive and reversible inhibitor of MAO. Bioorg Med Chem 19:7416-24 (2011)  
Target
Name:
Amine oxidase [flavin-containing] B
Synonyms:
AOFB_HUMAN MAOB Monoamine oxidase type B (MAO B) Monoamine oxidase type B (MAOB)
Type:
Protein
Mol. Mass.:
58768.76
Organism:
Homo sapiens (Human)
Description:
P27338
Residue:
520
  
Inhibitor
Name:
BDBM50359639
Synonyms:
CHEMBL1928855
Type:
Small organic molecule
Emp. Form.:
C13H12O2
Mol. Mass.:
200.2332
SMILES:
CC1=C(C)C(=O)c2cc(C)ccc2C1=O
: