Target
Amine oxidase [flavin-containing] A
Ligand
BDBM50359639
Substrate
Meas. Tech.
ChEMBL_792783 (CHEMBL1930786)
Ki
6000±n/a nM
Citation
 Coelho Cerqueira, ENetz, PADiniz, CPetry do Canto, VFollmer, C Molecular insights into human monoamine oxidase (MAO) inhibition by 1,4-naphthoquinone: evidences for menadione (vitamin K3) acting as a competitive and reversible inhibitor of MAO. Bioorg Med Chem 19:7416-24 (2011)  
Target
Name:
Amine oxidase [flavin-containing] A
Synonyms:
AOFA_HUMAN MAO-A Monoamine oxidase Monoamine oxidase type A (MAO A) Monoamine oxidase type A (MAOA)
Type:
Protein
Mol. Mass.:
59689.53
Organism:
Homo sapiens (Human)
Description:
P21397
Residue:
527
  
Inhibitor
Name:
BDBM50359639
Synonyms:
CHEMBL1928855
Type:
Small organic molecule
Emp. Form.:
C13H12O2
Mol. Mass.:
200.2332
SMILES:
CC1=C(C)C(=O)c2cc(C)ccc2C1=O
: