Target
Ephrin type-A receptor 4
Ligand
BDBM50359970
Substrate
Meas. Tech.
ChEMBL_792193 (CHEMBL1930640)
IC50
4500±n/a nM
Citation
 van Linden, OPFarenc, CZoutman, WHHameetman, LWijtmans, MLeurs, RTensen, CPSiegal, Gde Esch, IJ Fragment based lead discovery of small molecule inhibitors for the EPHA4 receptor tyrosine kinase. Eur J Med Chem 47:493-500 (2012)  
Target
Name:
Ephrin type-A receptor 4
Synonyms:
EPHA4 Ephrin receptor HEK8 TYRO1
Type:
PROTEIN
Mol. Mass.:
109859.29
Organism:
Homo sapiens (Human)
Description:
ChEMBL_586961
Residue:
986
  
Inhibitor
Name:
BDBM50359970
Synonyms:
CHEMBL1927262
Type:
Small organic molecule
Emp. Form.:
C17H17FN4
Mol. Mass.:
296.3421
SMILES:
Cc1ccc(F)cc1-c1nc2[nH]nc(N)c2c2CCCCc12
: