Target
B1 bradykinin receptor
Ligand
BDBM50355083
Substrate
Meas. Tech.
ChEMBL_796434 (CHEMBL1937749)
IC50
3405±n/a nM
Citation
 Bryan, MCBiswas, KPeterkin, TARzasa, RMArik, LLehto, SGSun, HHsieh, FYXu, CFremeau, RTAllen, JR Chromenones as potent bradykinin B1 antagonists. Bioorg Med Chem Lett 22:619-22 (2011)  
Target
Name:
B1 bradykinin receptor
Synonyms:
B1 BRADYKININ B1R BK-1 receptor BRADYB1 | Bradykinin B1 receptor
Type:
Enzyme
Mol. Mass.:
40508.87
Organism:
Homo sapiens (Human)
Description:
P46663
Residue:
353
  
Inhibitor
Name:
BDBM50355083
Synonyms:
CHEMBL1835762
Type:
Small organic molecule
Emp. Form.:
C32H34N4O2
Mol. Mass.:
506.638
SMILES:
Cc1nn(-c2cccc(c2)C(=O)N[C@@H]2CCCc3cc(CN4CCCCC4)ccc23)c(=O)c2ccccc12
: