Target
Beta-2 adrenergic receptor
Ligand
BDBM25392
Substrate
Meas. Tech.
ChEMBL_795270 (CHEMBL1937030)
Ki
501±n/a nM
Citation
 Soriano-Ursúa, MAMcNaught-Flores, DANieto-Alamilla, GSegura-Cabrera, ACorrea-Basurto, JArias-Montaño, JATrujillo-Ferrara, JG Cell-based and in-silico studies on the high intrinsic activity of two boron-containing salbutamol derivatives at the humanß2-adrenoceptor. Bioorg Med Chem 20:933-41 (2012)  
Target
Name:
Beta-2 adrenergic receptor
Synonyms:
ADRB2 ADRB2_HUMAN Beta-2 adrenoceptor | Beta-2 adrenoreceptor
Type:
Mol. Mass.:
46461.69
Organism:
Homo sapiens (Human)
Description:
P07550
Residue:
413
  
Inhibitor
Name:
BDBM25392
Synonyms:
4-[1-hydroxy-2-(isopropylamino)ethyl]pyrocatechol;hydrochloride 4-{1-hydroxy-2-[(propan-2-yl)amino]ethyl}benzene-1,2-diol, 2 ISOPROTERONOL Isoproterenol Isoproterenol,(+) Norisodrine | Novodrin
Type:
Small organic molecule
Emp. Form.:
C11H17NO3
Mol. Mass.:
211.2576
SMILES:
CC(C)NCC(O)c1ccc(O)c(O)c1
: