Target
Beta-2 adrenergic receptor
Ligand
BDBM50361247
Substrate
Meas. Tech.
ChEMBL_795271 (CHEMBL1937031)
EC50
145±n/a nM
Citation
 Soriano-Ursúa, MAMcNaught-Flores, DANieto-Alamilla, GSegura-Cabrera, ACorrea-Basurto, JArias-Montaño, JATrujillo-Ferrara, JG Cell-based and in-silico studies on the high intrinsic activity of two boron-containing salbutamol derivatives at the humanß2-adrenoceptor. Bioorg Med Chem 20:933-41 (2012)  
Target
Name:
Beta-2 adrenergic receptor
Synonyms:
ADRB2 ADRB2_HUMAN Beta-2 adrenoceptor | Beta-2 adrenoreceptor
Type:
Mol. Mass.:
46461.69
Organism:
Homo sapiens (Human)
Description:
P07550
Residue:
413
  
Inhibitor
Name:
BDBM50361247
Synonyms:
ALBUTEROL Levalbuterol | Levolin
Type:
Small organic molecule
Emp. Form.:
C13H21NO3
Mol. Mass.:
239.3107
SMILES:
CC(C)(C)NC[C@H](O)c1ccc(O)c(CO)c1
: