Target
Adenosine receptor A3
Ligand
BDBM50361304
Substrate
Meas. Tech.
ChEMBL_794927 (CHEMBL1936206)
Ki
125±n/a nM
Citation
 Baraldi, PGSaponaro, GAghazadeh Tabrizi, MBaraldi, SRomagnoli, RMoorman, ARVarani, KBorea, PAPreti, D Pyrrolo- and pyrazolo-[3,4-e][1,2,4]triazolo[1,5-c]pyrimidines as adenosine receptor antagonists. Bioorg Med Chem 20:1046-59 (2012)  
Target
Name:
Adenosine receptor A3
Synonyms:
A3 adenosine receptor (hA3) ADORA3 | Adenosine A3 receptor (A3AR)
Type:
G Protein-Coupled Receptor (GPCR)
Mol. Mass.:
36197.32
Organism:
Homo sapiens (Human)
Description:
P0DMS8
Residue:
318
  
Inhibitor
Name:
BDBM50361304
Synonyms:
CHEMBL1935760
Type:
Small organic molecule
Emp. Form.:
C11H9N7O
Mol. Mass.:
255.2355
SMILES:
Cn1cc2nc(N)n3nc(nc3c2n1)-c1ccco1
: