Target
Adenosine receptor A1
Ligand
BDBM50051241
Substrate
Meas. Tech.
ChEMBL_794898 (CHEMBL1936134)
Ki
350±n/a nM
Citation
 Baraldi, PGSaponaro, GAghazadeh Tabrizi, MBaraldi, SRomagnoli, RMoorman, ARVarani, KBorea, PAPreti, D Pyrrolo- and pyrazolo-[3,4-e][1,2,4]triazolo[1,5-c]pyrimidines as adenosine receptor antagonists. Bioorg Med Chem 20:1046-59 (2012)  
Target
Name:
Adenosine receptor A1
Synonyms:
A1 adenosine receptor (hA1) AA1R_HUMAN ADORA1 Adenosine A1-receptor Adenosine receptor A1 (hA1) | Adenosine transporter (AdT)
Type:
G Protein-Coupled Receptor (GPCR)
Mol. Mass.:
36520.92
Organism:
Homo sapiens (Human)
Description:
P30542
Residue:
326
  
Inhibitor
Name:
BDBM50051241
Synonyms:
2-(furan-2-yl)-7-(3-phenylpropyl)-7H-pyrazolo[4,3-e][1,2,4]triazolo[1,5-c]pyrimidin-5-amine 2-Furan-2-yl-7-(3-phenyl-propyl)-7H-pyrazolo[4,3-e][1,2,4]triazolo[1,5-c]pyrimidin-5-ylamine(SCH 63390) SCH-63390
Type:
Small organic molecule
Emp. Form.:
C19H17N7O
Mol. Mass.:
359.3846
SMILES:
Nc1nc2n(CCCc3ccccc3)ncc2c2nc(nn12)-c1ccco1
: