Target
Amine oxidase [flavin-containing] B
Ligand
BDBM50109389
Substrate
Meas. Tech.
ChEMBL_799279 (CHEMBL1941829)
IC50
761500±n/a nM
Citation
 Wichitnithad, WO'Callaghan, JPMiller, DBTrain, BCCallery, PS Time-dependent slowly-reversible inhibition of monoamine oxidase A by N-substituted 1,2,3,6-tetrahydropyridines. Bioorg Med Chem 19:7482-92 (2011)  
Target
Name:
Amine oxidase [flavin-containing] B
Synonyms:
AOFB_HUMAN MAOB Monoamine oxidase type B (MAO B) Monoamine oxidase type B (MAOB)
Type:
Protein
Mol. Mass.:
58768.76
Organism:
Homo sapiens (Human)
Description:
P27338
Residue:
520
  
Inhibitor
Name:
BDBM50109389
Synonyms:
1-Phenethyl-piperidine CHEMBL75228 N-phenethylpiperidine
Type:
Small organic molecule
Emp. Form.:
C13H19N
Mol. Mass.:
189.2967
SMILES:
C(Cc1ccccc1)N1CCCCC1
: