Target
Amine oxidase [flavin-containing] A
Ligand
BDBM50109389
Substrate
Meas. Tech.
ChEMBL_799283 (CHEMBL1941833)
Ki
121400±n/a nM
Citation
 Wichitnithad, WO'Callaghan, JPMiller, DBTrain, BCCallery, PS Time-dependent slowly-reversible inhibition of monoamine oxidase A by N-substituted 1,2,3,6-tetrahydropyridines. Bioorg Med Chem 19:7482-92 (2011)  
Target
Name:
Amine oxidase [flavin-containing] A
Synonyms:
AOFA_HUMAN MAO-A Monoamine oxidase Monoamine oxidase type A (MAO A) Monoamine oxidase type A (MAOA)
Type:
Protein
Mol. Mass.:
59689.53
Organism:
Homo sapiens (Human)
Description:
P21397
Residue:
527
  
Inhibitor
Name:
BDBM50109389
Synonyms:
1-Phenethyl-piperidine CHEMBL75228 N-phenethylpiperidine
Type:
Small organic molecule
Emp. Form.:
C13H19N
Mol. Mass.:
189.2967
SMILES:
C(Cc1ccccc1)N1CCCCC1
: