Target
Glutathione S-transferase Mu 1
Ligand
BDBM50361793
Substrate
Meas. Tech.
ChEMBL_799591 (CHEMBL1941297)
IC50
56600±n/a nM
Citation
 Wang, CHWu, HTCheng, HMYen, TJLu, IHChang, HCJao, SCShing, TKLi, WS Inhibition of glutathione S-transferase M1 by new gabosine analogues is essential for overcoming cisplatin resistance in lung cancer cells. J Med Chem 54:8574-81 (2011)  
Target
Name:
Glutathione S-transferase Mu 1
Synonyms:
GST class-mu 1 GSTM1 GSTM1_HUMAN GSTM1b-1b Glutathione S-transferase Mu 1 glutathione S-transferase
Type:
PROTEIN
Mol. Mass.:
25712.03
Organism:
Homo sapiens (Human)
Description:
ChEMBL_799596
Residue:
218
  
Inhibitor
Name:
BDBM50361793
Synonyms:
CHEMBL1938634
Type:
Small organic molecule
Emp. Form.:
C26H30O8
Mol. Mass.:
470.5116
SMILES:
CO[C@]1(C)O[C@H]2[C@@H](OCc3ccc4ccccc4c3)C=C(COC(C)=O)C(=O)[C@@H]2O[C@@]1(C)OC
: