Target
Hydroxycarboxylic acid receptor 2
Ligand
BDBM50362626
Substrate
Meas. Tech.
ChEMBL_798318 (CHEMBL1943806)
EC50
26±n/a nM
Citation
 Huang, XSu, JRao, AUTang, HZhou, WZhu, XChen, XLiu, ZHuang, YDegrado, SXiao, DQin, JAslanian, RMcKittrick, BAGreenfeder, SHeek, MvChintala, MPalani, A SAR studies of C2 ethers of 2H-pyrano[2,3-d]pyrimidine-2,4,7(1H,3H)-triones as nicotinic acid receptor (NAR) agonist. Bioorg Med Chem Lett 22:854-8 (2012)  
Target
Name:
Hydroxycarboxylic acid receptor 2
Synonyms:
G-protein coupled receptor 109A GPR109A HCAR2 HM74A NIACR1 Nicotinic acid receptor 1
Type:
G Protein-Coupled Receptor (GPCR)
Mol. Mass.:
41868.22
Organism:
Homo sapiens (Human)
Description:
Membranes from CHO cells expressing the recombinant human GPR109A were used in competition binding assay.
Residue:
363
  
Inhibitor
Name:
BDBM50362626
Synonyms:
CHEMBL1939043
Type:
Small organic molecule
Emp. Form.:
C15H16N2O5
Mol. Mass.:
304.2979
SMILES:
CCc1cc(=O)oc2nc(OCC#CCCCO)[nH]c(=O)c12
: