Target
5-hydroxytryptamine receptor 2A
Ligand
BDBM50002334
Substrate
Meas. Tech.
ChEMBL_797755 (CHEMBL1944114)
Ki
22±n/a nM
Citation
 Peprah, KZhu, XYEyunni, SVSetola, VRoth, BLAblordeppey, SY Multi-receptor drug design: Haloperidol as a scaffold for the design and synthesis of atypical antipsychotic agents. Bioorg Med Chem 20:1291-7 (2012)  
Target
Name:
5-hydroxytryptamine receptor 2A
Synonyms:
5-HT-2 5-HT2A 5-hydroxytryptamine receptor 2A (5HT-2A) 5HT2A_HUMAN HTR2A | Serotonin receptor 2A
Type:
undefined
Mol. Mass.:
52607.65
Organism:
Homo sapiens (Human)
Description:
P28223
Residue:
471
  
Inhibitor
Name:
BDBM50002334
Synonyms:
1-(4-Fluoro-phenyl)-4-(4-pyrimidin-2-yl-piperazin-1-yl)-butan-1-one CHEMBL140872
Type:
Small organic molecule
Emp. Form.:
C18H21FN4O
Mol. Mass.:
328.3839
SMILES:
Fc1ccc(cc1)C(=O)CCCN1CCN(CC1)c1ncccn1
: