Target
Tumor susceptibility gene 101 protein
Ligand
BDBM50362892
Substrate
Meas. Tech.
ChEMBL_800317 (CHEMBL1948067)
Ki
2600±n/a nM
Citation
 Kim, SELiu, FIm, YJStephen, AGFivash, MJWaheed, AAFreed, EOFisher, RJHurley, JHBurke, TR Elucidation of New Binding Interactions with the Tumor Susceptibility Gene 101 (Tsg101) Protein Using Modified HIV-1 Gag-p6 Derived Peptide Ligands. ACS Med Chem Lett 2:337-341 (2011)  
Target
Name:
Tumor susceptibility gene 101 protein
Synonyms:
TS101_HUMAN | TSG101
Type:
PROTEIN
Mol. Mass.:
43943.30
Organism:
Homo sapiens (Human)
Description:
ChEMBL_800321
Residue:
390
  
Inhibitor
Name:
BDBM50362892
Synonyms:
CHEMBL1946564
Type:
Small organic molecule
Emp. Form.:
C58H75N11O18
Mol. Mass.:
1214.279
SMILES:
C[C@@H](O)[C@H](NC(=O)[C@@H]1C[C@H](CN1C(=O)[C@H](CCC(O)=O)NC(=O)[C@@H]1CCCN1C(C)=O)O\N=C\c1ccc-2c(Cc3ccccc-23)c1)C(=O)N[C@@H](C)C(=O)N1CCC[C@H]1C(=O)N1CCC[C@H]1C(=O)N[C@@H](CCC(O)=O)C(=O)N[C@@H](CCC(O)=O)C(N)=O
: