Target
Histamine H3 receptor
Ligand
BDBM50363316
Substrate
Meas. Tech.
ChEMBL_801168 (CHEMBL1949039)
EC50
1.1±n/a nM
Citation
 Tao, MAimone, LDGruner, JAMathiasen, JRHuang, ZLyons, JRaddatz, RHudkins, RL Synthesis and structure-activity relationship of 5-pyridazin-3-one phenoxypiperidines as potent, selective histamine H(3) receptor inverse agonists. Bioorg Med Chem Lett 22:1073-7 (2012)  
Target
Name:
Histamine H3 receptor
Synonyms:
G-protein coupled receptor 97 HH3R HRH3 Histamine H3 receptor (H3) Histamine receptor (H3 and H4)
Type:
G Protein-Coupled Receptor (GPCR)
Mol. Mass.:
48691.47
Organism:
Homo sapiens (Human)
Description:
Binding assays were using CHO cells stably expressing hH3R receptors.
Residue:
445
  
Inhibitor
Name:
BDBM50363316
Synonyms:
CHEMBL1945845
Type:
Small organic molecule
Emp. Form.:
C20H25N3O2
Mol. Mass.:
339.4314
SMILES:
Cc1n[nH]c(=O)cc1-c1ccc(OC2CCN(CC2)C2CCC2)cc1
: