Target
Muscarinic acetylcholine receptor M2
Ligand
BDBM50363317
Substrate
Meas. Tech.
ChEMBL_801167 (CHEMBL1949038)
IC50
340±n/a nM
Citation
 Tao, MAimone, LDGruner, JAMathiasen, JRHuang, ZLyons, JRaddatz, RHudkins, RL Synthesis and structure-activity relationship of 5-pyridazin-3-one phenoxypiperidines as potent, selective histamine H(3) receptor inverse agonists. Bioorg Med Chem Lett 22:1073-7 (2012)  
Target
Name:
Muscarinic acetylcholine receptor M2
Synonyms:
ACM2_HUMAN Cholinergic, muscarinic M2 Muscarinic acetylcholine receptor M2 and M5 | RecName: Full=Muscarinic acetylcholine receptor M2
Type:
GPCR
Mol. Mass.:
51730.61
Organism:
Homo sapiens (Human)
Description:
P08172
Residue:
466
  
Inhibitor
Name:
BDBM50363317
Synonyms:
CHEMBL1945848
Type:
Small organic molecule
Emp. Form.:
C25H28N4O2
Mol. Mass.:
416.5154
SMILES:
Cc1nn(-c2ccccn2)c(=O)cc1-c1ccc(OC2CCN(CC2)C2CCC2)cc1
: