Target
Histamine H3 receptor
Ligand
BDBM50363323
Substrate
Meas. Tech.
ChEMBL_801099 (CHEMBL1948884)
Ki
4±n/a nM
Citation
 Tao, MAimone, LDGruner, JAMathiasen, JRHuang, ZLyons, JRaddatz, RHudkins, RL Synthesis and structure-activity relationship of 5-pyridazin-3-one phenoxypiperidines as potent, selective histamine H(3) receptor inverse agonists. Bioorg Med Chem Lett 22:1073-7 (2012)  
Target
Name:
Histamine H3 receptor
Synonyms:
G-protein coupled receptor 97 HH3R HRH3 Histamine H3 receptor (H3) Histamine receptor (H3 and H4)
Type:
G Protein-Coupled Receptor (GPCR)
Mol. Mass.:
48691.47
Organism:
Homo sapiens (Human)
Description:
Binding assays were using CHO cells stably expressing hH3R receptors.
Residue:
445
  
Inhibitor
Name:
BDBM50363323
Synonyms:
CHEMBL1945847
Type:
Small organic molecule
Emp. Form.:
C21H27N3O2
Mol. Mass.:
353.458
SMILES:
Cc1nn(C)c(=O)cc1-c1ccc(OC2CCN(CC2)C2CCC2)cc1
: