Target
Histamine H3 receptor
Ligand
BDBM50363322
Substrate
Meas. Tech.
ChEMBL_801260 (CHEMBL1947323)
Ki
8±n/a nM
Citation
 Tao, MAimone, LDGruner, JAMathiasen, JRHuang, ZLyons, JRaddatz, RHudkins, RL Synthesis and structure-activity relationship of 5-pyridazin-3-one phenoxypiperidines as potent, selective histamine H(3) receptor inverse agonists. Bioorg Med Chem Lett 22:1073-7 (2012)  
Target
Name:
Histamine H3 receptor
Synonyms:
HH3R Hrh3
Type:
G Protein-Coupled Receptor (GPCR)
Mol. Mass.:
48607.98
Organism:
Rattus norvegicus (rat)
Description:
Residue:
445
  
Inhibitor
Name:
BDBM50363322
Synonyms:
CHEMBL1945851
Type:
Small organic molecule
Emp. Form.:
C24H27N3O2S
Mol. Mass.:
421.555
SMILES:
Cc1nn(-c2ccsc2)c(=O)cc1-c1ccc(OC2CCN(CC2)C2CCC2)cc1
: