Target
Translocator protein
Ligand
BDBM50363519
Substrate
Meas. Tech.
ChEMBL_801514 (CHEMBL1948441)
Ki
0.73±n/a nM
Citation
 Wadsworth, HJones, PAChau, WFDurrant, CFouladi, NPassmore, JO'Shea, DWynn, DMorisson-Iveson, VEwan, AThaning, MMantzilas, DGausemel, IKhan, IBlack, AAvory, MTrigg, W [¹¿?¿F]GE-180: a novel fluorine-18 labelled PET tracer for imaging Translocator protein 18 kDa (TSPO). Bioorg Med Chem Lett 22:1308-13 (2012)  
Target
Name:
Translocator protein
Synonyms:
Benzodiazepine receptors; peripheral & central Mbr PBR Peripheral benzodiazepine receptor (PBR) TSPO_RAT | Tspo
Type:
Mitochondrion membrane protein
Mol. Mass.:
18945.84
Organism:
Rattus norvegicus (rat)
Description:
Competitive binding experiments were performed on rat kidney mitochondrial membranes.
Residue:
169
  
Inhibitor
Name:
BDBM50363519
Synonyms:
CHEMBL1946096
Type:
Small organic molecule
Emp. Form.:
C24H27FN2O
Mol. Mass.:
378.4824
SMILES:
CCN(Cc1ccccc1)C(=O)C1CCCc2c1c1ccccc1n2CCF
: