Target
Carbonic anhydrase
Ligand
BDBM11611
Substrate
Meas. Tech.
ChEMBL_801827 (CHEMBL1947439)
Ki
965±n/a nM
Citation
 Ohradanova, AVullo, DPastorekova, SPastorek, JJackson, DJWörheide, GSupuran, CT Cloning, characterization and sulfonamide inhibition studies of ana-carbonic anhydrase from the living fossil sponge Astrosclera willeyana. Bioorg Med Chem 20:1403-10 (2012)  
Target
Name:
Carbonic anhydrase
Synonyms:
Astrosclerin-3
Type:
PROTEIN
Mol. Mass.:
33233.07
Organism:
Astrosclera willeyana
Description:
ChEMBL_801827
Residue:
292
  
Inhibitor
Name:
BDBM11611
Synonyms:
β-CA inhibitor, 10 4-amino-3,5-dibromobenzene-1-sulfonamide halogenosulfanilamide deriv. 12
Type:
Small organic molecule
Emp. Form.:
C6H6Br2N2O2S
Mol. Mass.:
329.997
SMILES:
Nc1c(Br)cc(cc1Br)S(N)(=O)=O
: