Target
Carbonic anhydrase
Ligand
BDBM10869
Substrate
Meas. Tech.
ChEMBL_801827 (CHEMBL1947439)
Ki
393±n/a nM
Citation
 Ohradanova, AVullo, DPastorekova, SPastorek, JJackson, DJWörheide, GSupuran, CT Cloning, characterization and sulfonamide inhibition studies of ana-carbonic anhydrase from the living fossil sponge Astrosclera willeyana. Bioorg Med Chem 20:1403-10 (2012)  
Target
Name:
Carbonic anhydrase
Synonyms:
Astrosclerin-3
Type:
PROTEIN
Mol. Mass.:
33233.07
Organism:
Astrosclera willeyana
Description:
ChEMBL_801827
Residue:
292
  
Inhibitor
Name:
BDBM10869
Synonyms:
5-imino-4-methyl-4,5-dihydro-1,3,4-thiadiazole-2-sulfonamide aromatic/heteroaromatic sulfonamide 14
Type:
Small organic molecule
Emp. Form.:
C3H6N4O2S2
Mol. Mass.:
194.235
SMILES:
Cn1nc(sc1=N)S(N)(=O)=O
: