Target
Carbonic anhydrase
Ligand
BDBM11625
Substrate
Meas. Tech.
ChEMBL_801827 (CHEMBL1947439)
Ki
2.8±n/a nM
Citation
 Ohradanova, AVullo, DPastorekova, SPastorek, JJackson, DJWörheide, GSupuran, CT Cloning, characterization and sulfonamide inhibition studies of ana-carbonic anhydrase from the living fossil sponge Astrosclera willeyana. Bioorg Med Chem 20:1403-10 (2012)  
Target
Name:
Carbonic anhydrase
Synonyms:
Astrosclerin-3
Type:
PROTEIN
Mol. Mass.:
33233.07
Organism:
Astrosclera willeyana
Description:
ChEMBL_801827
Residue:
292
  
Inhibitor
Name:
BDBM11625
Synonyms:
2-N-(4-amino-3-chloro-5-fluorobenzene)-1,3,4-thiadiazole-2,5-disulfonamide CHEMBL71611 | aminobenzolamide 18
Type:
Small organic molecule
Emp. Form.:
C8H7ClFN5O4S3
Mol. Mass.:
387.819
SMILES:
Nc1c(F)cc(cc1Cl)S(=O)(=O)Nc1nnc(s1)S(N)(=O)=O
: