Target
Carbonic anhydrase
Ligand
BDBM10872
Substrate
Meas. Tech.
ChEMBL_801827 (CHEMBL1947439)
Ki
16±n/a nM
Citation
 Ohradanova, AVullo, DPastorekova, SPastorek, JJackson, DJWörheide, GSupuran, CT Cloning, characterization and sulfonamide inhibition studies of ana-carbonic anhydrase from the living fossil sponge Astrosclera willeyana. Bioorg Med Chem 20:1403-10 (2012)  
Target
Name:
Carbonic anhydrase
Synonyms:
Astrosclerin-3
Type:
PROTEIN
Mol. Mass.:
33233.07
Organism:
Astrosclera willeyana
Description:
ChEMBL_801827
Residue:
292
  
Inhibitor
Name:
BDBM10872
Synonyms:
4-amino-N-[2-(4-sulfamoylphenyl)ethyl]benzene-1-sulfonamide aromatic/heteroaromatic sulfonamide 17
Type:
Small organic molecule
Emp. Form.:
C14H17N3O4S2
Mol. Mass.:
355.432
SMILES:
Nc1ccc(cc1)S(=O)(=O)NCCc1ccc(cc1)S(N)(=O)=O
: