Target
Histone-lysine N-methyltransferase EHMT2
Ligand
BDBM50315535
Substrate
Meas. Tech.
ChEMBL_803633 (CHEMBL1953573)
IC50
>100000±n/a nM
Citation
 Sun, YTakada, KTakemoto, YYoshida, MNogi, YOkada, SMatsunaga, S Gliotoxin analogues from a marine-derived fungus, Penicillium sp., and their cytotoxic and histone methyltransferase inhibitory activities. J Nat Prod 75:111-4 (2012)  
Target
Name:
Histone-lysine N-methyltransferase EHMT2
Synonyms:
BAT8 EHMT2 G9A Histone-lysine N-methyltransferase EHMT1/EHMT2 KMT1C Protein G9a (G9a)
Type:
Enzyme
Mol. Mass.:
132339.87
Organism:
Homo sapiens (Human)
Description:
Q96KQ7
Residue:
1210
  
Inhibitor
Name:
BDBM50315535
Synonyms:
CHEMBL1088981 | bis(methylthio)gliotoxin
Type:
Small organic molecule
Emp. Form.:
C15H20N2O4S2
Mol. Mass.:
356.46
SMILES:
CS[C@@]12CC3=CC=C[C@H](O)[C@H]3N1C(=O)[C@@](CO)(SC)N(C)C2=O
: