Target
5-hydroxytryptamine receptor 6
Ligand
BDBM50364313
Substrate
Meas. Tech.
ChEMBL_804629 (CHEMBL1953151)
Ki
243±n/a nM
Citation
 Tripathy, RMcHugh, RJBacon, ERSalvino, JMMorton, GCAimone, LDHuang, ZMathiasen, JRDiCamillo, AHuffman, MJMcKenna, BAKopec, KLu, LDQian, JAngeles, TSConnors, TSpais, CHolskin, BDuzic, ESchaffhauser, HRossé, GC Discovery of 7-arylsulfonyl-1,2,3,4, 4a,9a-hexahydro-benzo[4,5]furo[2,3-c]pyridines: identification of a potent and selective 5-HT6 receptor antagonist showing activity in rat social recognition test. Bioorg Med Chem Lett 22:1421-6 (2012)  
Target
Name:
5-hydroxytryptamine receptor 6
Synonyms:
5-HT-6 5-hydroxytryptamine receptor 6 Htr6 Serotonin (5-HT) receptor Serotonin receptor 6
Type:
Enzyme Catalytic Domain
Mol. Mass.:
46945.51
Organism:
RAT
Description:
5-HT6 HTR6 RAT::P31388
Residue:
436
  
Inhibitor
Name:
BDBM50364313
Synonyms:
CHEMBL1949765
Type:
Small organic molecule
Emp. Form.:
C18H19NO3S
Mol. Mass.:
329.413
SMILES:
Cc1cccc(c1)S(=O)(=O)c1ccc2[C@@H]3CCNC[C@@H]3Oc2c1
: