Target
5-hydroxytryptamine receptor 2C
Ligand
BDBM50364326
Substrate
Meas. Tech.
ChEMBL_804663 (CHEMBL1953185)
Ki
19000±n/a nM
Citation
 Tripathy, RMcHugh, RJBacon, ERSalvino, JMMorton, GCAimone, LDHuang, ZMathiasen, JRDiCamillo, AHuffman, MJMcKenna, BAKopec, KLu, LDQian, JAngeles, TSConnors, TSpais, CHolskin, BDuzic, ESchaffhauser, HRossé, GC Discovery of 7-arylsulfonyl-1,2,3,4, 4a,9a-hexahydro-benzo[4,5]furo[2,3-c]pyridines: identification of a potent and selective 5-HT6 receptor antagonist showing activity in rat social recognition test. Bioorg Med Chem Lett 22:1421-6 (2012)  
Target
Name:
5-hydroxytryptamine receptor 2C
Synonyms:
5-HT-1C 5-HT1C 5-HT2C-INI 5-HTR2C 5-hydroxytryptamine receptor 2C (5-HT-2C) 5HT-1C HTR1C Serotonin (5-HT3) receptor Serotonin Receptor 2C
Type:
G Protein-Coupled Receptor (GPCR)
Mol. Mass.:
51836.79
Organism:
Homo sapiens (Human)
Description:
P28335
Residue:
458
  
Inhibitor
Name:
BDBM50364326
Synonyms:
CHEMBL1949930
Type:
Small organic molecule
Emp. Form.:
C21H25NO5S
Mol. Mass.:
403.492
SMILES:
COc1cc(OC(C)C)cc(c1)S(=O)(=O)c1ccc2[C@@H]3CCNC[C@@H]3Oc2c1
: