Target
Carbonic anhydrase 1
Ligand
BDBM50344898
Substrate
Meas. Tech.
ChEMBL_804819 (CHEMBL1953638)
Ki
101000±n/a nM
Citation
 Ohradanova, AVullo, DPastorekova, SPastorek, JJackson, DJWörheide, GSupuran, CT Anion inhibition studies of ana-carbonic anhydrase from the living fossil Astrosclera willeyana. Bioorg Med Chem Lett 22:1314-6 (2012)  
Target
Name:
Carbonic anhydrase 1
Synonyms:
CA-I CAB Carbonate dehydratase I Carbonic anhydrase 1 (CA I) Carbonic anhydrase 1 (Recombinant CA I) Carbonic anhydrase B Carbonic anhydrase I (CA I) Carbonic anhydrase I (CAI) Carbonic anhydrase isoenzyme I (hCA I) | hCA
Type:
Enzyme
Mol. Mass.:
28873.37
Organism:
Homo sapiens (Human)
Description:
P00915
Residue:
261
  
Inhibitor
Name:
BDBM50344898
Synonyms:
CHEMBL1081267 | sodium perruthenate
Type:
Small organic molecule
Emp. Form.:
O4Ru
Mol. Mass.:
165.07
SMILES:
O=[Ru-](=O)(=O)=O
: