Target
Cytochrome P450 3A5
Ligand
BDBM50364627
Substrate
Meas. Tech.
ChEMBL_802674 (CHEMBL1953082)
IC50
6100±n/a nM
Citation
 Song, XLi, XRuiz, CHYin, YFeng, YKamenecka, TMCameron, MD Imidazopyridines as selective CYP3A4 inhibitors. Bioorg Med Chem Lett 22:1611-4 (2012)  
Target
Name:
Cytochrome P450 3A5
Synonyms:
CP3A5_HUMAN Cytochrome P450 3A5 | Cytochrome P450 3A5 (CYP3A5)
Type:
Protein
Mol. Mass.:
57118.00
Organism:
Homo sapiens (Human)
Description:
P20815
Residue:
502
  
Inhibitor
Name:
BDBM50364627
Synonyms:
CHEMBL1951322
Type:
Small organic molecule
Emp. Form.:
C19H14ClN5O
Mol. Mass.:
363.8
SMILES:
Clc1ccccc1NC(=O)Nc1ccc(cc1)-c1ccnc2nc[nH]c12
: