Target
Cytochrome P450 3A5
Ligand
BDBM50364653
Substrate
Meas. Tech.
ChEMBL_802674 (CHEMBL1953082)
IC50
980±n/a nM
Citation
 Song, XLi, XRuiz, CHYin, YFeng, YKamenecka, TMCameron, MD Imidazopyridines as selective CYP3A4 inhibitors. Bioorg Med Chem Lett 22:1611-4 (2012)  
Target
Name:
Cytochrome P450 3A5
Synonyms:
CP3A5_HUMAN Cytochrome P450 3A5 | Cytochrome P450 3A5 (CYP3A5)
Type:
Protein
Mol. Mass.:
57118.00
Organism:
Homo sapiens (Human)
Description:
P20815
Residue:
502
  
Inhibitor
Name:
BDBM50364653
Synonyms:
CHEMBL1951443
Type:
Small organic molecule
Emp. Form.:
C22H22N4O2
Mol. Mass.:
374.4357
SMILES:
CC(C)NC(=O)c1cccc(NC(=O)Nc2ccc(cc2)-c2ccncc2)c1
: