Target
Cytochrome P450 3A5
Ligand
BDBM50364657
Substrate
Meas. Tech.
ChEMBL_802674 (CHEMBL1953082)
IC50
6800±n/a nM
Citation
 Song, XLi, XRuiz, CHYin, YFeng, YKamenecka, TMCameron, MD Imidazopyridines as selective CYP3A4 inhibitors. Bioorg Med Chem Lett 22:1611-4 (2012)  
Target
Name:
Cytochrome P450 3A5
Synonyms:
CP3A5_HUMAN Cytochrome P450 3A5 | Cytochrome P450 3A5 (CYP3A5)
Type:
Protein
Mol. Mass.:
57118.00
Organism:
Homo sapiens (Human)
Description:
P20815
Residue:
502
  
Inhibitor
Name:
BDBM50364657
Synonyms:
CHEMBL1951447
Type:
Small organic molecule
Emp. Form.:
C26H21N5O2
Mol. Mass.:
435.4772
SMILES:
COc1cccc(c1)-c1ccc(NC(=O)Nc2ccc(cc2)-c2ccnc3nc[nH]c23)cc1
: