Target
Metabotropic glutamate receptor 1
Ligand
BDBM50364714
Substrate
Meas. Tech.
ChEMBL_803066 (CHEMBL1954372)
IC50
15±n/a nM
Citation
 Bennett, CEBurnett, DAGreenlee, WJKnutson, CEKorakas, PLi, CTulshian, DWu, WLBertorelli, RFredduzzi, SGrilli, MLozza, GReggiani, AVeltri, A Fused tricyclic mGluR1 antagonists for the treatment of neuropathic pain. Bioorg Med Chem Lett 22:1575-8 (2012)  
Target
Name:
Metabotropic glutamate receptor 1
Synonyms:
GPRC1A GRM1_HUMAN Metabotropic Glutamate 1a | metabotropic glutamate 1
Type:
Enzyme
Mol. Mass.:
132358.19
Organism:
Homo sapiens (Human)
Description:
Q13255
Residue:
1194
  
Inhibitor
Name:
BDBM50364714
Synonyms:
CHEMBL1951886
Type:
Small organic molecule
Emp. Form.:
C19H16N4O2S
Mol. Mass.:
364.421
SMILES:
COc1ccc(cc1)-n1ccc2c(sc3ncnc(NC4CC4)c23)c1=O
: