Target
Metabotropic glutamate receptor 1
Ligand
BDBM50364720
Substrate
Meas. Tech.
ChEMBL_803068 (CHEMBL1954374)
Ki
1.9±n/a nM
Citation
 Bennett, CEBurnett, DAGreenlee, WJKnutson, CEKorakas, PLi, CTulshian, DWu, WLBertorelli, RFredduzzi, SGrilli, MLozza, GReggiani, AVeltri, A Fused tricyclic mGluR1 antagonists for the treatment of neuropathic pain. Bioorg Med Chem Lett 22:1575-8 (2012)  
Target
Name:
Metabotropic glutamate receptor 1
Synonyms:
GRM1_RAT Grm1 Metabotropic glutamate receptor Mglur1 metabotropic glutamate 1/5-D metabotropic glutamate receptor 1 isoform alpha precursor
Type:
Enzyme Catalytic Domain
Mol. Mass.:
133240.47
Organism:
RAT
Description:
metabotropic glutamate 1/2 0 RAT::P23385
Residue:
1199
  
Inhibitor
Name:
BDBM50364720
Synonyms:
CHEMBL1951659
Type:
Small organic molecule
Emp. Form.:
C19H17N3OS
Mol. Mass.:
335.423
SMILES:
CN(C)c1ccnc2sc3c(ccn(-c4ccc(C)cc4)c3=O)c12
: