Target
Potassium voltage-gated channel subfamily H member 2
Ligand
BDBM50364748
Substrate
Meas. Tech.
ChEMBL_803093 (CHEMBL1954529)
IC50
6500±n/a nM
Citation
 Cumming, JGTucker, HOldfield, JFielding, CHighton, AFaull, AWild, MBrown, DWells, SShaw, J Balancing hERG affinity and absorption in the discovery of AZD5672, an orally active CCR5 antagonist for the treatment of rheumatoid arthritis. Bioorg Med Chem Lett 22:1655-9 (2012)  
Target
Name:
Potassium voltage-gated channel subfamily H member 2
Synonyms:
1,3-beta-glucan synthase component GLS2 ERG Eag-related protein 1 Ether-a-go-go-related gene (HERG) Ether-a-go-go-related gene potassium channel 1 Ether-a-go-go-related gene potassium channel 1 (hERG1) Ether-a-go-go-related protein 1 H-ERG KCNH2 Potassium voltage-gated channel subfamily H member 2 (hERG) Voltage-gated potassium channel subunit Kv11.1 hERG Potassium Channel 1 | putative potassium channel subunit
Type:
Multi-pass membrane protein
Mol. Mass.:
126672.65
Organism:
Homo sapiens (Human)
Description:
Q12809
Residue:
1159
  
Inhibitor
Name:
BDBM50364748
Synonyms:
CHEMBL1952100
Type:
Small organic molecule
Emp. Form.:
C31H43Cl2N3O5S2
Mol. Mass.:
672.726
SMILES:
CCN(C1CCN(CC[C@H](C2CCN(CC2)S(C)(=O)=O)c2cc(Cl)cc(Cl)c2)CC1)C(=O)Cc1ccc(cc1)S(C)(=O)=O
: