Target
Cannabinoid receptor 1
Ligand
BDBM50364927
Substrate
Meas. Tech.
ChEMBL_804070 (CHEMBL1952635)
EC50
4253±n/a nM
Citation
 Cheng, YXPourashraf, MLuo, XSrivastava, SWalpole, CSalois, DSt-Onge, SPayza, KLessard, EYu, XHTomaszewski, MJ ¿-Carbolines: a novel class of cannabinoid agonists with high aqueous solubility and restricted CNS penetration. Bioorg Med Chem Lett 22:1619-24 (2012)  
Target
Name:
Cannabinoid receptor 1
Synonyms:
CANN6 CB-R CNR CNR1_HUMAN Cannabinoid receptor Cannabinoid receptor 1 (brain)
Type:
G Protein-Coupled Receptor (GPCR)
Mol. Mass.:
52868.96
Organism:
Homo sapiens (Human)
Description:
P21554
Residue:
472
  
Inhibitor
Name:
BDBM50364927
Synonyms:
CHEMBL1950342
Type:
Small organic molecule
Emp. Form.:
C23H31N3O
Mol. Mass.:
365.5117
SMILES:
CC1CCN(CC1)C(=O)c1ccc2[nH]c3CCN(Cc3c2c1)C1CCCC1
: