Target
Dihydroorotate dehydrogenase (quinone), mitochondrial
Ligand
BDBM50365236
Substrate
Meas. Tech.
ChEMBL_808186 (CHEMBL1961098)
IC50
>100000±n/a nM
Citation
 Coteron, JMMarco, MEsquivias, JDeng, XWhite, KLWhite, JKoltun, MEl Mazouni, FKokkonda, SKatneni, KBhamidipati, RShackleford, DMAngulo-Barturen, IFerrer, SBJiménez-Díaz, MBGamo, FJGoldsmith, EJCharman, WNBathurst, IFloyd, DMatthews, DBurrows, JNRathod, PKCharman, SAPhillips, MA Structure-guided lead optimization of triazolopyrimidine-ring substituents identifies potent Plasmodium falciparum dihydroorotate dehydrogenase inhibitors with clinical candidate potential. J Med Chem 54:5540-61 (2011)  
Target
Name:
Dihydroorotate dehydrogenase (quinone), mitochondrial
Synonyms:
DHODH Dihydroorotate dehydrogenase Dihydroorotate dehydrogenase, mitochondrial Dihydroorotate oxidase (DHODH) | PYRD_HUMAN
Type:
Enzyme
Mol. Mass.:
42881.33
Organism:
Homo sapiens (Human)
Description:
Q02127
Residue:
395
  
Inhibitor
Name:
BDBM50365236
Synonyms:
CHEMBL1956276
Type:
Small organic molecule
Emp. Form.:
C15H14ClN5
Mol. Mass.:
299.758
SMILES:
Cc1cc(Nc2ccc(Cl)cc2)n2nc(nc2n1)C1CC1
: