Target
Adenosine receptor A2a
Ligand
BDBM50268107
Substrate
Meas. Tech.
ChEMBL_806473 (CHEMBL1959512)
Ki
328±n/a nM
Citation
 Baraldi, PGBaraldi, SSaponaro, GPreti, DRomagnoli, RPiccagli, LCavalli, ARecanatini, MMoorman, ARZaid, ANVarani, KBorea, PATabrizi, MA Novel 1,3-dipropyl-8-(3-benzimidazol-2-yl-methoxy-1-methylpyrazol-5-yl)xanthines as potent and selective A2B adenosine receptor antagonists. J Med Chem 55:797-811 (2012)  
Target
Name:
Adenosine receptor A2a
Synonyms:
A2A adenosine receptor (hA2A) ADENOSINE A2 ADORA2 Adenosine A2A receptor (A2AAR)
Type:
G Protein-Coupled Receptor (GPCR)
Mol. Mass.:
44716.46
Organism:
Homo sapiens (Human)
Description:
P29274
Residue:
412
  
Inhibitor
Name:
BDBM50268107
Synonyms:
CHEMBL485862 N-(2-(2-phenyl-6-(4-(3-phenylpropyl)piperazine-1-carbonyl)-7H-pyrrolo[2,3-d]pyrimidin-4-ylamino)ethyl)acetamide | OSIP-339391
Type:
Small organic molecule
Emp. Form.:
C30H35N7O2
Mol. Mass.:
525.6446
SMILES:
CC(=O)NCCNc1nc(nc2[nH]c(cc12)C(=O)N1CCN(CCCc2ccccc2)CC1)-c1ccccc1
: