Target
Carbonic anhydrase 1
Ligand
BDBM50366038
Substrate
Meas. Tech.
ChEMBL_807327 (CHEMBL1960507)
Ki
>200000±n/a nM
Citation
 Carta, FVullo, DMaresca, AScozzafava, ASupuran, CT New chemotypes acting as isozyme-selective carbonic anhydrase inhibitors with low affinity for the offtarget cytosolic isoform II. Bioorg Med Chem Lett 22:2182-5 (2012)  
Target
Name:
Carbonic anhydrase 1
Synonyms:
CA-I CAB Carbonate dehydratase I Carbonic anhydrase 1 (CA I) Carbonic anhydrase 1 (Recombinant CA I) Carbonic anhydrase B Carbonic anhydrase I (CA I) Carbonic anhydrase I (CAI) Carbonic anhydrase isoenzyme I (hCA I) | hCA
Type:
Enzyme
Mol. Mass.:
28873.37
Organism:
Homo sapiens (Human)
Description:
P00915
Residue:
261
  
Inhibitor
Name:
BDBM50366038
Synonyms:
CHEMBL1356238
Type:
Small organic molecule
Emp. Form.:
C5H5NOS
Mol. Mass.:
127.164
SMILES:
[O-][n+]1ccccc1S
: