Target
Carbonic anhydrase 5B, mitochondrial
Ligand
BDBM50366038
Substrate
Meas. Tech.
ChEMBL_807322 (CHEMBL1960502)
Ki
3550±n/a nM
Citation
 Carta, FVullo, DMaresca, AScozzafava, ASupuran, CT New chemotypes acting as isozyme-selective carbonic anhydrase inhibitors with low affinity for the offtarget cytosolic isoform II. Bioorg Med Chem Lett 22:2182-5 (2012)  
Target
Name:
Carbonic anhydrase 5B, mitochondrial
Synonyms:
CA-VB CAH5B_HUMAN Carbonic Anhydrase VB Carbonic anhydrase 5B, mitochondrial Carbonic anhydrase V | Carbonic anhydrase VB (CA VB)
Type:
Enzyme
Mol. Mass.:
36440.83
Organism:
Homo sapiens (Human)
Description:
Human (cloned) isozyme
Residue:
317
  
Inhibitor
Name:
BDBM50366038
Synonyms:
CHEMBL1356238
Type:
Small organic molecule
Emp. Form.:
C5H5NOS
Mol. Mass.:
127.164
SMILES:
[O-][n+]1ccccc1S
: