Target
Prostaglandin E2 receptor EP2 subtype
Ligand
BDBM50360626
Substrate
Meas. Tech.
ChEMBL_808314 (CHEMBL1961331)
Ki
9.3±n/a nM
Citation
 Kambe, TMaruyama, TNakai, YYoshida, HOida, HMaruyama, TAbe, NNishiura, ANakai, HToda, M Discovery of novel prostaglandin analogs as potent and selective EP2/EP4 dual agonists. Bioorg Med Chem 20:2235-51 (2012)  
Target
Name:
Prostaglandin E2 receptor EP2 subtype
Synonyms:
PE2R2_MOUSE Prostaglandin E2 Prostanoid EP2 receptor Ptgerep2
Type:
G-protein coupled receptor
Mol. Mass.:
40495.26
Organism:
Mus musculus (Mouse)
Description:
Residue:
362
  
Inhibitor
Name:
BDBM50360626
Synonyms:
CHEMBL1933722
Type:
Small organic molecule
Emp. Form.:
C21H24N2O4S2
Mol. Mass.:
432.556
SMILES:
Cc1cccc(C[C@H](O)\C=C\[C@H]2CCC(=O)N2CCSc2nc(cs2)C(O)=O)c1
: