Target
Tissue alpha-L-fucosidase
Ligand
BDBM50285247
Substrate
Meas. Tech.
ChEBML_33962
Ki
11000±n/a nM
Citation
 Dumas, DPKajimoto, TLiu, KKWong, CBerkowitz, DBDanieshefsky, SJ Azasugar and glycal inhibitors of -L-fucosidase Bioorg Med Chem Lett 2:33-36 (1992)    Article 
Target
Name:
Tissue alpha-L-fucosidase
Synonyms:
Alpha-L-fucosidase I FUCA1 Tissue alpha-L-fucosidase
Type:
PROTEIN
Mol. Mass.:
53690.69
Organism:
Homo sapiens (Human)
Description:
ChEMBL_34088
Residue:
466
  
Inhibitor
Name:
BDBM50285247
Synonyms:
(2R,3R,4R,5R)-2-Methyl-piperidine-3,4,5-triol | CHEMBL69152
Type:
Small organic molecule
Emp. Form.:
C6H13NO3
Mol. Mass.:
147.1723
SMILES:
C[C@H]1NC[C@@H](O)[C@@H](O)[C@@H]1O
: