Target
Tubulin alpha-1A chain
Ligand
BDBM50280140
Substrate
Meas. Tech.
ChEMBL_212055 (CHEMBL815360)
Ki
750±n/a nM
Citation
 Hodgson, STCon Jenkins, DKnick, VRapson, EWatts, SD Synthesis and biological properties of 1069C: a new synthetic antitumour agent with very low cross-resistance potential Bioorg Med Chem Lett 2:1257-1262 (1992)    Article 
Target
Name:
Tubulin alpha-1A chain
Synonyms:
TBA1A_PIG Tubulin Tubulin alpha-1A chain
Type:
Protein
Mol. Mass.:
50049.25
Organism:
Sus scrofa (Pig)
Description:
P02550
Residue:
451
  
Inhibitor
Name:
BDBM50280140
Synonyms:
CHEMBL418565 | [6-(3,4,5-Trimethoxy-benzyloxy)-imidazo[1,2-b]pyridazin-2-yl]-carbamic acid methyl ester
Type:
Small organic molecule
Emp. Form.:
C18H20N4O6
Mol. Mass.:
388.3746
SMILES:
COC(=O)Nc1cn2nc(OCc3cc(OC)c(OC)c(OC)c3)ccc2n1
: