Target
Type-1 angiotensin II receptor B
Ligand
BDBM50282254
Substrate
Meas. Tech.
ChEMBL_34833 (CHEMBL648767)
Ki
6100±n/a nM
Citation
 Poss, MAGu, ZRyono, DEReid, JASieber-McMaster, ESpitzmiller, ERDejneka, TDickinson, KEWilliams, SBMoreland, SDelaney, CLBird, JWaldron, TLSchaeffer, TRHedberg, SPetrillo, EW 1,4-substituted indoles: a potent and selective class of angiostensin II receptor antagonists Bioorg Med Chem Lett 4:145-150 (1994)    Article 
Target
Name:
Type-1 angiotensin II receptor B
Synonyms:
AGTRB_RAT Agtr1 Angiotensin II AT1B Angiotensin II type 1b (AT-1b) receptor Type-1B angiotensin II receptor
Type:
Enzyme Catalytic Domain
Mol. Mass.:
40929.44
Organism:
RAT
Description:
Angiotensin II AT1B 0 RAT::P29089
Residue:
359
  
Inhibitor
Name:
BDBM50282254
Synonyms:
CHEMBL36259 | Potassium; 2-[6-(2-butyl-4-chloro-5-formyl-imidazol-1-ylmethyl)-benzooxazol-2-yl]-benzoate
Type:
Small organic molecule
Emp. Form.:
C23H19ClN3O4
Mol. Mass.:
436.868
SMILES:
CCCCc1nc(Cl)c(C=O)n1Cc1ccc2nc(oc2c1)-c1ccccc1C([O-])=O
: