Target
Neuromedin-K receptor
Ligand
BDBM50024320
Substrate
Meas. Tech.
ChEBML_209542
IC50
3000±n/a nM
Citation
 Horwell, DCHowson, WNaylor, DWilems, HM The design of polar -turn dipeptide mimetics Bioorg Med Chem Lett 5:1445-1450 (1995)    Article 
Target
Name:
Neuromedin-K receptor
Synonyms:
NK-3 receptor NK3R NKR Neurokinin B receptor Neuromedin-3 receptor (NK-3R) Neuromedin-K receptor Neuromedin-K receptor (NK3) TAC3R Tachykinin receptor 3 | Tachykinin receptor 3 (NK3)
Type:
Enzyme
Mol. Mass.:
52221.96
Organism:
Homo sapiens (Human)
Description:
P29371
Residue:
465
  
Inhibitor
Name:
BDBM50024320
Synonyms:
CHEMBL32301 [1-(1-Carbamoyl-2-phenyl-ethylcarbamoyl)-2-(1H-indol-3-yl)-ethyl]-carbamic acid tert-butyl ester
Type:
Small organic molecule
Emp. Form.:
C25H30N4O4
Mol. Mass.:
450.5301
SMILES:
CC(C)(C)OC(=O)N[C@@H](Cc1c[nH]c2ccccc12)C(=O)N[C@@H](Cc1ccccc1)C(N)=O
: