Target
Endothelin-1 receptor
Ligand
BDBM50329850
Substrate
Meas. Tech.
ChEMBL_63512 (CHEMBL677262)
Ki
18±n/a nM
Citation
 Murugesan, NZhengxiang, GuLee, VWebb, MLLiu, ECHermsmeier, MHunt, JT Design and synthesis of nonpeptidal endothelin receptor antagonists based on the structure of a cyclic pentapeptide Bioorg Med Chem Lett 5:253-258 (1995)    Article 
Target
Name:
Endothelin-1 receptor
Synonyms:
EDNRA ET-A ETA-R Endothelin receptor type A hET-AR
Type:
Enzyme Catalytic Domain
Mol. Mass.:
48736.88
Organism:
Homo sapiens (Human)
Description:
P25101
Residue:
427
  
Inhibitor
Name:
BDBM50329850
Synonyms:
(R)-3-Amino-4-[(S)-2-((R)-1-{(S)-1-[(R)-1-(1H-indol-3-ylmethyl)-2-oxo-ethylcarbamoyl]-3-methyl-but-3-enylcarbamoyl}-2-methyl-propylcarbamoyl)-pyrrolidin-1-yl]-4-oxo-butyric acid CHEMBL1269102 [(5R,8R,11S,14R,16aR)-8-(1H-Indol-3-ylmethyl)-11-isobutyl-14-isopropyl-4,7,10,13,16-pentaoxo-hexadecahydro-3a,6,9,12,15-pentaaza-cyclopentacyclopentadecen-5-yl]-acetic acid [8-(1H-Indol-3-ylmethyl)-11-isobutyl-14-isopropyl-4,7,10,13,16-pentaoxo-hexadecahydro-3a,6,9,12,15-pentaaza-cyclopentacyclopentadecen-5-yl]-acetic acid
Type:
Small organic molecule
Emp. Form.:
C31H42N6O7
Mol. Mass.:
610.7012
SMILES:
CC(C)C[C@@H]1NC(=O)[C@H](NC(=O)[C@@H]2CCCN2C(=O)[C@H](CC(O)=O)NC(=O)[C@@H](Cc2c[nH]c3ccccc23)NC1=O)C(C)C
: