Target
3-phosphoshikimate 1-carboxyvinyltransferase
Ligand
BDBM50283581
Substrate
Meas. Tech.
ChEMBL_64947 (CHEMBL675692)
IC50
7900000±n/a nM
Citation
 Peterson, MLCorey, SDFont, JLWalker, MCSikorski, JA New simplified inhibitors of EPSP synthase: The importance of ring size for recognition at the shikimate 3-phosphate site Bioorg Med Chem Lett 6:2853-2858 (1996)    Article 
Target
Name:
3-phosphoshikimate 1-carboxyvinyltransferase
Synonyms:
5-enolpyruvylshikimate-3-phosphate synthase aroA
Type:
PROTEIN
Mol. Mass.:
46089.22
Organism:
Escherichia coli (strain K12)
Description:
ChEMBL_65087
Residue:
427
  
Inhibitor
Name:
BDBM50283581
Synonyms:
3-Hydroxy-5-phosphonooxy-benzoic acid;disodium | CHEMBL88227
Type:
Small organic molecule
Emp. Form.:
C7H5O7P
Mol. Mass.:
232.0853
SMILES:
Oc1cc(OP(O)([O-])=O)cc(c1)C([O-])=O
: