Target
3-phosphoshikimate 1-carboxyvinyltransferase
Ligand
BDBM50288340
Substrate
Meas. Tech.
ChEMBL_64947 (CHEMBL675692)
IC50
50000000±n/a nM
Citation
 Peterson, MLCorey, SDFont, JLWalker, MCSikorski, JA New simplified inhibitors of EPSP synthase: The importance of ring size for recognition at the shikimate 3-phosphate site Bioorg Med Chem Lett 6:2853-2858 (1996)    Article 
Target
Name:
3-phosphoshikimate 1-carboxyvinyltransferase
Synonyms:
5-enolpyruvylshikimate-3-phosphate synthase aroA
Type:
PROTEIN
Mol. Mass.:
46089.22
Organism:
Escherichia coli (strain K12)
Description:
ChEMBL_65087
Residue:
427
  
Inhibitor
Name:
BDBM50288340
Synonyms:
5-Phosphono-pyrrolidine-2-carboxylic acid | CHEMBL95682
Type:
Small organic molecule
Emp. Form.:
C5H10NO5P
Mol. Mass.:
195.1104
SMILES:
OC(=O)C1CCC(=N1)P(O)(O)O
: