Target
Putative inactive group IIC secretory phospholipase A2
Ligand
BDBM50289471
Substrate
Meas. Tech.
ChEMBL_199686 (CHEMBL802915)
IC50
>200000±n/a nM
Citation
 Lee, DMarshall, LABolognese, BAdams, JL Tetrazole is an effective Sn-3 phosphate replacement in substrate analog inhibitors of 14 kDa phospholipase A2 Bioorg Med Chem Lett 7:1427-1432 (1997)    Article 
Target
Name:
Putative inactive group IIC secretory phospholipase A2
Synonyms:
PA2GC_HUMAN Phosphatidylcholine 2-acylhydrolase-like protein GIIC Putative inactive group IIC secretory phospholipase A2
Type:
PROTEIN
Mol. Mass.:
16855.80
Organism:
Homo sapiens (Human)
Description:
ChEMBL_199685
Residue:
149
  
Inhibitor
Name:
BDBM50289471
Synonyms:
CHEMBL34519 | N-(5-Hydroxy-1-octadecyloxymethyl-pentyl)-acetamide
Type:
Small organic molecule
Emp. Form.:
C26H53NO3
Mol. Mass.:
427.7039
SMILES:
(CCCCO)NC(C)=O
: