Target
Putative inactive group IIC secretory phospholipase A2
Ligand
BDBM50289480
Substrate
Meas. Tech.
ChEMBL_199687 (CHEMBL802916)
IC50
>200000±n/a nM
Citation
 Lee, DMarshall, LABolognese, BAdams, JL Tetrazole is an effective Sn-3 phosphate replacement in substrate analog inhibitors of 14 kDa phospholipase A2 Bioorg Med Chem Lett 7:1427-1432 (1997)    Article 
Target
Name:
Putative inactive group IIC secretory phospholipase A2
Synonyms:
PA2GC_HUMAN Phosphatidylcholine 2-acylhydrolase-like protein GIIC Putative inactive group IIC secretory phospholipase A2
Type:
PROTEIN
Mol. Mass.:
16855.80
Organism:
Homo sapiens (Human)
Description:
ChEMBL_199685
Residue:
149
  
Inhibitor
Name:
BDBM50289480
Synonyms:
CHEMBL284373 | N-{1-(Octadecyloxymethyl)-3-[(4-methylphenyl)sulfinyl]propyl}acetamide
Type:
Small organic molecule
Emp. Form.:
C31H55NO3S
Mol. Mass.:
521.838
SMILES:
(CCS(=O)c1ccc(C)cc1)NC(C)=O
: